{"text_format":"1","workbook":"xlsx","n_sheets":6,"sheets":["Home","Certificate","Demographic Summary","Summary","Database","divisions"],"not_rendered":{"charts":0,"images":4,"macros":1,"external_links":1,"defined_names":34,"comments":0,"pivot_tables":0},"unopened":[],"bounds":{"document_bytes":16777216,"sheet_cells":100000,"rows_first":2000,"rows_last":500,"rows_between":2000,"halvings":0,"cell_chars":16384,"cell_head_chars":4096},"cells_cut":0,"cells_raw":0,"read":"whole","date_system":"1900"}

{"sheet":"Home","index":0,"n_rows":59,"n_cols":5,"rows_kept":59,"cut":false,"hidden":false,"merged":[[0,0,0,4],[1,0,1,4],[3,0,3,4],[4,0,4,4],[5,0,6,4],[14,2,14,4],[15,2,15,4],[16,2,16,4],[45,1,46,4],[10,0,11,4]]}
["Republic of the Philippines"]
["Department of Education"]
[]
["e-SAT CONSOLIDATION FORM"]
["SY 2025-2028"]
["This tool was created to automate the consolidation of Electronic Self-Assessment Tool (e-SAT)  accomplished by teachers."]
[]
[]
[]
["PRIVACY NOTICE"]
["By using this tool, you are authorizing the personnel of the Department of Education to collect, process, retain, and dispose of your personal information in accordance with the Data Privacy Act of 2012."]
[]
[]
[]
[null,"Consolidation Level","School"]
[null,"School Name"]
[null,"School ID"]
[]
[null,"Auto-generate Certificates","YES","Certificate File Type","Single Excel file"]
[]
[]
[]
[]
[]
[]
[]
["INSTRUCTIONS"]
[]
["To consolidate all e-SAT of Beginning Towards Proficient, Proficient, Highly Proficient, and Distinguished Teachers per SCHOOL, do the following:"]
[]
{"$rows_left_out":30}
{"sheet":"Certificate","index":1,"n_rows":21,"n_cols":1,"rows_kept":21,"cut":false,"hidden":false,"merged":[[11,0,11,6],[0,0,0,6],[1,0,1,6],[2,0,2,6],[3,0,3,6],[4,0,4,6],[5,0,5,6],[6,0,6,6],[7,0,7,6],[8,0,8,6],[9,0,9,6],[10,0,10,6],[19,0,19,6],[20,0,20,6],[12,0,12,6],[14,0,14,6],[15,0,15,6],[16,0,16,6],[17,0,17,6],[18,0,18,6]]}
[]
["Republic of the Philippines"]
["Department of Education"]
["<REGION>"]
["<DIVISION OF>"]
["<NAME OF SCHOOL>"]
["<School Address>"]
[]
["Certificate of Completion"]
["This certificate is presented to "]
["<NAME OF TEACHER>"]
["for successfully completing the Electronic Self-Assessment Tool (e-SAT) for"]
["<Beginning towards Proficient/Proficient/Highly Proficient/Distinguished> Teacher for the School Year 2025-2028."]
[]
["Given this <nth day of month year> at"]
[{"$f":"A6&\", \"&A7&\".\"","v":"<NAME OF SCHOOL>, <School Address>."}]
[]
[]
[]
["<NAME>"]
["ICT Coordinator / School Head / Focal Person in charge of e-SAT"]

{"sheet":"Demographic Summary","index":2,"n_rows":66,"n_cols":5,"rows_kept":66,"cut":false,"hidden":true,"merged":[[14,1,14,4],[15,1,15,4],[8,0,8,4],[1,0,1,4],[2,0,2,4],[3,0,3,4],[4,0,4,4],[5,0,5,4],[7,0,7,4],[9,1,9,4],[10,1,10,4],[11,1,11,4],[12,1,12,4],[13,1,13,4]]}
["The Count column represents the number of personnel that participated in the survey."]
["Republic of the Philippines"]
["Department of Education"]
[]
[{"$f":"Home!C16","v":0}]
[{"$f":"Certificate!A7","v":"<School Address>"}]
[]
["DEMOGRAPHIC PROFILE"]
[]
["Region:",{"$f":"Database!L2","v":0}]
["Division:",{"$f":"Database!M2","v":0}]
["School ID:",{"$f":"Database!N2","v":0}]
["School Name:",{"$f":"Database!O2","v":0}]
["School Type:",{"$f":"Database!P2","v":0}]
["School Size:",{"$f":"Database!Q2","v":0}]
["Curricular Classification:",{"$f":"Database!R2","v":0}]
[]
["Career Stages","Count",null,"Level Taught","Count"]
["Beginning towards Proficient",{"$f":"COUNTIF(Database!D:D,\"BtP\")","v":0},null,"Kindergarten",{"$f":"COUNTIF(Database!J:J,$D19)","v":0}]
["Proficient",{"$f":"COUNTIF(Database!D:D,\"P\")","v":0},null,"Elementary",{"$f":"COUNTIF(Database!J:J,$D20)","v":0}]
["Highly Proficient",{"$f":"COUNTIF(Database!D:D,\"HP\")","v":0},null,"Junior High School",{"$f":"COUNTIF(Database!J:J,$D21)","v":0}]
["Distinguished",{"$f":"COUNTIF(Database!D:D,\"D\")","v":0},null,"Senior High School",{"$f":"COUNTIF(Database!J:J,$D22)","v":0}]
[]
["Position","Count",null,"Area of Specialization","Count"]
["Teacher I",{"$f":"COUNTIF(Database!C:C,$A25)","v":0},null,"English",{"$f":"COUNTIF(Database!S:S,\"TRUE\")","v":0}]
["Teacher II",{"$f":"COUNTIF(Database!C:C,$A26)","v":0},null,"Filipino",{"$f":"COUNTIF(Database!T:T,\"TRUE\")","v":0}]
["Teacher III",{"$f":"COUNTIF(Database!C:C,$A27)","v":0},null,"Mathematics",{"$f":"COUNTIF(Database!U:U,\"TRUE\")","v":0}]
["Teacher IV",{"$f":"COUNTIF(Database!C:C,$A28)","v":0},null,"General Science",{"$f":"COUNTIF(Database!V:V,\"TRUE\")","v":0}]
["Teacher V",{"$f":"COUNTIF(Database!C:C,$A29)","v":0},null,"Biology",{"$f":"COUNTIF(Database!W:W,\"TRUE\")","v":0}]
["Teacher VI",{"$f":"COUNTIF(Database!C:C,$A30)","v":0},null,"Chemistry",{"$f":"COUNTIF(Database!X:X,\"TRUE\")","v":0}]
{"$rows_left_out":37}
{"sheet":"Summary","index":3,"n_rows":280,"n_cols":21,"rows_kept":280,"cut":false,"hidden":true,"merged":[[232,1,233,2],[232,3,233,15],[221,3,221,11],[222,3,222,11],[223,3,223,11],[224,1,228,2],[224,3,224,11],[224,13,228,13],[224,14,228,15],[225,3,225,11],[226,3,226,11],[227,3,227,11],[228,3,228,11],[264,1,268,2],[264,3,264,11],[264,13,268,13],[264,14,268,15],[265,3,265,11],[266,3,266,11],[267,3,267,11],[268,3,268,11],[259,1,263,2],[259,3,259,11],[259,13,263,13],[259,14,263,15],[260,3,260,11],[261,3,261,11],[262,3,262,11],[263,3,263,11],[254,1,258,2],[254,3,254,11],[254,13,258,13],[254,14,258,15],[255,3,255,11],[256,3,256,11],[257,3,257,11],[258,3,258,11],[249,1,253,2],[249,3,249,11],[249,13,253,13],[249,14,253,15],[250,3,250,11],[251,3,251,11],[252,3,252,11],[253,3,253,11],[244,1,248,2],[244,3,244,11],[244,13,248,13],[244,14,248,15],[245,3,245,11],[246,3,246,11],[247,3,247,11],[248,3,248,11],[239,1,243,2],[239,3,239,11],[239,13,243,13],[239,14,243,15],[240,3,240,11],[241,3,241,11],[242,3,242,11],[243,3,243,11],[234,1,238,2],[234,3,234,11],[234,13,238,13],[234,14,238,15],[235,3,235,11],[236,3,236,11],[237,3,237,11],[238,3,238,11],[208,2,208,11],[212,1,213,2],[212,3,213,15],[214,1,218,2],[214,3,214,11],[214,13,218,13],[214,14,218,15],[215,3,215,11],[216,3,216,11],[217,3,217,11],[218,3,218,11],[219,1,223,2],[219,3,219,11],[219,13,223,13],[219,14,223,15],[220,3,220,11],[205,2,205,11],[206,2,206,11],[202,2,202,11],[204,2,204,11],[190,2,190,11],[193,2,193,11],[194,2,194,11],[191,2,191,11],[192,2,192,11],[188,1,188,11],[188,12,188,13],[188,14,188,15],[169,2,169,11],[170,2,170,11],[199,2,199,11],[200,2,200,11],[196,2,196,11],[197,2,197,11],[185,2,185,11],[186,2,186,11],[181,2,181,11],[183,2,183,11],[178,2,178,11],[180,2,180,11],[167,2,167,11],[149,2,149,11],[150,2,150,11],[158,2,158,11],[168,2,168,11],[175,2,175,11],[176,2,176,11],[172,2,172,11],[173,2,173,11],[146,2,146,11],[147,2,147,11],[143,1,143,11],[155,2,155,11],[156,2,156,11],[143,12,143,13],[165,12,165,13],[165,14,165,15],[160,2,160,11],[162,2,162,11],[152,2,152,11],[154,2,154,11],[143,14,143,15],[145,2,145,11],[159,2,159,11],[163,2,163,11],[165,1,165,11],[127,2,127,11],[128,2,128,11],[124,2,124,11],[125,2,125,11],[133,2,133,11],[135,2,135,11],[130,2,130,11],[131,2,131,11],[139,2,139,11],[136,2,136,11],[137,2,137,11],[116,2,116,11],[117,2,117,11],[112,2,112,11],[114,2,114,11],[122,2,122,11],[123,2,123,11],[119,1,119,11],[119,12,119,13],[119,14,119,15],[121,2,121,11],[104,2,104,11],[100,2,100,11],[101,2,101,11],[109,2,109,11],[111,2,111,11],[106,2,106,11],[107,2,107,11],[91,2,91,11],[93,2,93,11],[98,2,98,11],[99,2,99,11],[94,2,94,11],[96,1,96,11],[96,14,96,15],[81,2,81,11],[103,2,103,11],[86,2,86,11],[87,2,87,11],[83,2,83,11],[85,2,85,11],[74,12,74,13],[74,14,74,15],[76,2,76,11],[89,2,89,11],[80,2,80,11],[90,2,90,11],[77,2,77,11],[78,2,78,11],[74,1,74,11],[55,2,55,11],[56,2,56,11],[53,2,53,11],[54,2,54,11],[96,12,96,13],[70,2,70,11],[61,2,61,11],[62,2,62,11],[50,12,50,13],[58,2,58,11],[59,2,59,11],[67,2,67,11],[68,2,68,11],[64,2,64,11],[66,2,66,11],[50,14,50,15],[31,2,31,11],[32,2,32,11],[50,1,50,11],[52,2,52,11],[29,2,29,11],[30,2,30,11],[37,2,37,11],[38,2,38,11],[34,2,34,11],[35,2,35,11],[47,2,47,11],[48,2,48,11],[43,2,43,11],[45,2,45,11],[40,2,40,11],[42,2,42,11],[21,2,21,11],[17,2,17,11],[18,2,18,11],[25,2,25,11],[27,1,27,11],[27,12,27,13],[27,14,27,15],[22,2,22,11],[24,2,24,11],[14,2,14,11],[16,2,16,11],[11,2,11,11],[12,2,12,11],[20,2,20,11],[0,1,0,15],[1,1,1,15],[8,2,8,11],[9,2,9,11],[4,1,4,15],[5,1,5,11],[5,12,5,13],[5,14,5,15],[7,2,7,11]]}
[null,"Electronic Self-Assessment Tool"]
[null,"SY 2025 - 2028"]
[]
[null,"BEGINNING TOWARDS PROFICIENT AND PROFICIENT TEACHERS"]
[]
[null,"INDICATORS - YEAR 1",null,null,null,null,null,null,null,null,null,null,"Level of Capability",null,"Priority for Development"]
[null,"Domain 1. Content Knowledge and Pedagogy"]
[null,"1.1.2","Applied knowledge of content within and across curriculum teaching areas",null,null,null,null,null,null,null,null,null,{"$f":"AVERAGE(INDIRECT(\"Database!\"&S8&\":\"&S8))","v":{"$error":"#DIV/0!"}},{"$f":"VLOOKUP(M8,leveldesc,2,1)","v":{"$error":"#DIV/0!"}},{"$f":"AVERAGE(INDIRECT(\"Database!\"&U8&\":\"&U8))","v":{"$error":"#DIV/0!"}},{"$f":"VLOOKUP(O8,leveldesc,2,1)","v":{"$error":"#DIV/0!"}},null,{"$f":"MATCH(\"BP Yr1 1.1.2 LC\",Database!1:1,0)","v":68},{"$f":"SUBSTITUTE(ADDRESS(1, R8, 4), \"1\", \"\")","v":"BP"},{"$f":"MATCH(\"BP Yr1 1.1.2 PD\",Database!1:1,0)","v":194},{"$f":"SUBSTITUTE(ADDRESS(1, T8, 4), \"1\", \"\")","v":"GL"}]
[null,"1.4.2","Used a range of teaching strategies that enhance learner achievement in literacy and numeracy skills",null,null,null,null,null,null,null,null,null,{"$f":"AVERAGE(INDIRECT(\"Database!\"&S9&\":\"&S9))","v":{"$error":"#DIV/0!"}},{"$f":"VLOOKUP(M9,leveldesc,2,1)","v":{"$error":"#DIV/0!"}},{"$f":"AVERAGE(INDIRECT(\"Database!\"&U9&\":\"&U9))","v":{"$error":"#DIV/0!"}},{"$f":"VLOOKUP(O9,leveldesc,2,1)","v":{"$error":"#DIV/0!"}},null,{"$f":"IF(C9<>\"\",R8+1,R8)","v":69},{"$f":"SUBSTITUTE(ADDRESS(1, R9, 4), \"1\", \"\")","v":"BQ"},{"$f":"IF(C9<>\"\",T8+1,T8)","v":195},{"$f":"SUBSTITUTE(ADDRESS(1, T9, 4), \"1\", \"\")","v":"GM"}]
[null,"1.5.2","Applied a range of teaching strategies to develop critical and creative thinking, as well as other higher-order thinking skills",null,null,null,null,null,null,null,null,null,{"$error":"#DIV/0!"},{"$f":"VLOOKUP(M10,leveldesc,2,1)","v":{"$error":"#DIV/0!"}},{"$error":"#DIV/0!"},{"$f":"VLOOKUP(O10,leveldesc,2,1)","v":{"$error":"#DIV/0!"}},null,{"$f":"IF(C10<>\"\",R9+1,R9)","v":70},{"$f":"SUBSTITUTE(ADDRESS(1, R10, 4), \"1\", \"\")","v":"BR"},{"$f":"IF(C10<>\"\",T9+1,T9)","v":196},{"$f":"SUBSTITUTE(ADDRESS(1, T10, 4), \"1\", \"\")","v":"GN"}]
[null,"Domain 2. Learning Environment",null,null,null,null,null,null,null,null,null,null,null,null,null,null,null,70,"BR",196,"GN"]
[null,"2.3.2","Managed classroom structure to engage learners, individually or in groups, in meaningful exploration, discovery and hands-on activities within a range of physical learning environments",null,null,null,null,null,null,null,null,null,{"$f":"AVERAGE(INDIRECT(\"Database!\"&S12&\":\"&S12))","v":{"$error":"#DIV/0!"}},{"$f":"VLOOKUP(M12,leveldesc,2,1)","v":{"$error":"#DIV/0!"}},{"$f":"AVERAGE(INDIRECT(\"Database!\"&U12&\":\"&U12))","v":{"$error":"#DIV/0!"}},{"$f":"VLOOKUP(O12,leveldesc,2,1)","v":{"$error":"#DIV/0!"}},null,71,"BS",197,"GO"]
[null,"2.6.2","Managed learner behavior constructively by applying positive and non-violent discipline to ensure learning- focused environments",null,null,null,null,null,null,null,null,null,{"$error":"#DIV/0!"},{"$f":"VLOOKUP(M13,leveldesc,2,1)","v":{"$error":"#DIV/0!"}},{"$error":"#DIV/0!"},{"$f":"VLOOKUP(O13,leveldesc,2,1)","v":{"$error":"#DIV/0!"}},null,72,"BT",198,"GP"]
[null,"Domain 3. Diversity of Learners",null,null,null,null,null,null,null,null,null,null,null,null,null,null,null,72,"BT",198,"GP"]
[null,"3.1.2","Used differentiated, developmentally appropriate learning experiences to address learners’ gender, needs, strengths, interests and experiences",null,null,null,null,null,null,null,null,null,{"$f":"AVERAGE(INDIRECT(\"Database!\"&S15&\":\"&S15))","v":{"$error":"#DIV/0!"}},{"$f":"VLOOKUP(M15,leveldesc,2,1)","v":{"$error":"#DIV/0!"}},{"$f":"AVERAGE(INDIRECT(\"Database!\"&U15&\":\"&U15))","v":{"$error":"#DIV/0!"}},{"$f":"VLOOKUP(O15,leveldesc,2,1)","v":{"$error":"#DIV/0!"}},null,73,"BU",199,"GQ"]
[null,"Domain 4. Curriculum and Planning",null,null,null,null,null,null,null,null,null,null,null,null,null,null,null,73,"BU",199,"GQ"]
[null,"4.1.2","Planned, managed and implemented developmentally sequenced teaching and learning processes to meet curriculum requirements and varied teaching contexts",null,null,null,null,null,null,null,null,null,{"$f":"AVERAGE(INDIRECT(\"Database!\"&S17&\":\"&S17))","v":{"$error":"#DIV/0!"}},{"$f":"VLOOKUP(M17,leveldesc,2,1)","v":{"$error":"#DIV/0!"}},{"$f":"AVERAGE(INDIRECT(\"Database!\"&U17&\":\"&U17))","v":{"$error":"#DIV/0!"}},{"$f":"VLOOKUP(O17,leveldesc,2,1)","v":{"$error":"#DIV/0!"}},null,74,"BV",200,"GR"]
[null,"4.4.2","Participated in collegial discussions that use teacher and learner feedback to  enrich teaching practice",null,null,null,null,null,null,null,null,null,{"$error":"#DIV/0!"},{"$f":"VLOOKUP(M18,leveldesc,2,1)","v":{"$error":"#DIV/0!"}},{"$error":"#DIV/0!"},{"$f":"VLOOKUP(O18,leveldesc,2,1)","v":{"$error":"#DIV/0!"}},null,75,"BW",201,"GS"]
[null,"4.5.2","Selected, developed, organized and used appropriate teaching and learning resources, including ICT, to address learning goals",null,null,null,null,null,null,null,null,null,{"$error":"#DIV/0!"},{"$f":"VLOOKUP(M19,leveldesc,2,1)","v":{"$error":"#DIV/0!"}},{"$error":"#DIV/0!"},{"$f":"VLOOKUP(O19,leveldesc,2,1)","v":{"$error":"#DIV/0!"}},null,76,"BX",202,"GT"]
[null,"Domain 5. Assessment and Reporting",null,null,null,null,null,null,null,null,null,null,null,null,null,null,null,76,"BX",202,"GT"]
[null,"5.1.2","Designed, selected, organized and used diagnostic, formative and summative assessment strategies consistent with curriculum requirements",null,null,null,null,null,null,null,null,null,{"$f":"AVERAGE(INDIRECT(\"Database!\"&S21&\":\"&S21))","v":{"$error":"#DIV/0!"}},{"$f":"VLOOKUP(M21,leveldesc,2,1)","v":{"$error":"#DIV/0!"}},{"$f":"AVERAGE(INDIRECT(\"Database!\"&U21&\":\"&U21))","v":{"$error":"#DIV/0!"}},{"$f":"VLOOKUP(O21,leveldesc,2,1)","v":{"$error":"#DIV/0!"}},null,77,"BY",203,"GU"]
[null,"5.2.2","Monitored and evaluated learner progress and achievement using learner attainment data",null,null,null,null,null,null,null,null,null,{"$error":"#DIV/0!"},{"$f":"VLOOKUP(M22,leveldesc,2,1)","v":{"$error":"#DIV/0!"}},{"$error":"#DIV/0!"},{"$f":"VLOOKUP(O22,leveldesc,2,1)","v":{"$error":"#DIV/0!"}},null,78,"BZ",204,"GV"]
[null,"5.4.2","Communicated promptly and clearly the learners’ needs, progress and achievement  to key stakeholders, including parents/guardians",null,null,null,null,null,null,null,null,null,{"$error":"#DIV/0!"},{"$f":"VLOOKUP(M23,leveldesc,2,1)","v":{"$error":"#DIV/0!"}},{"$error":"#DIV/0!"},{"$f":"VLOOKUP(O23,leveldesc,2,1)","v":{"$error":"#DIV/0!"}},null,79,"CA",205,"GW"]
[null,"Domain 7. Personal Growth and Professional Development",null,null,null,null,null,null,null,null,null,null,null,null,null,null,null,79,"CA",205,"GW"]
[null,"7.1.2","Applied a personal philosophy of teaching that is learner-centered",null,null,null,null,null,null,null,null,null,{"$f":"AVERAGE(INDIRECT(\"Database!\"&S25&\":\"&S25))","v":{"$error":"#DIV/0!"}},{"$f":"VLOOKUP(M25,leveldesc,2,1)","v":{"$error":"#DIV/0!"}},{"$f":"AVERAGE(INDIRECT(\"Database!\"&U25&\":\"&U25))","v":{"$error":"#DIV/0!"}},{"$f":"VLOOKUP(O25,leveldesc,2,1)","v":{"$error":"#DIV/0!"}},null,80,"CB",206,"GX"]
[null,"7.5.2","Set professional development goals based on the Philippine Professional Standards for Teachers",null,null,null,null,null,null,null,null,null,{"$error":"#DIV/0!"},{"$f":"VLOOKUP(M26,leveldesc,2,1)","v":{"$error":"#DIV/0!"}},{"$error":"#DIV/0!"},{"$f":"VLOOKUP(O26,leveldesc,2,1)","v":{"$error":"#DIV/0!"}},null,81,"CC",207,"GY"]
[null,null,null,null,null,null,null,null,null,null,null,null,null,null,null,null,null,81,"CC",207,"GY"]
[null,"INDICATORS - YEAR 2",null,null,null,null,null,null,null,null,null,null,"Level of Capability",null,"Priority for Development",null,null,81,"CC",207,"GY"]
[null,"Domain 1. Content Knowledge and Pedagogy",null,null,null,null,null,null,null,null,null,null,null,null,null,null,null,81,"CC",207,"GY"]
[null,"1.1.2","Applied knowledge of content within and across curriculum teaching areas",null,null,null,null,null,null,null,null,null,{"$f":"AVERAGE(INDIRECT(\"Database!\"&S30&\":\"&S30))","v":{"$error":"#DIV/0!"}},{"$f":"VLOOKUP(M30,leveldesc,2,1)","v":{"$error":"#DIV/0!"}},{"$f":"AVERAGE(INDIRECT(\"Database!\"&U30&\":\"&U30))","v":{"$error":"#DIV/0!"}},{"$f":"VLOOKUP(O30,leveldesc,2,1)","v":{"$error":"#DIV/0!"}},null,82,"CD",208,"GZ"]
{"$rows_left_out":251}
{"sheet":"Database","index":4,"n_rows":1,"n_cols":369,"rows_kept":1,"cut":false,"hidden":true,"merged":[]}
["No.","Name of Employee","Position Title","Proficiency","Employment Status","Age","Sex","Total Number of Years in Teaching","Highest Degree Obtained","Level Taught","Grade Level Taught","Region","Division","School ID","School Name","School Type","School Size","Curricular Classification","Area: English","Area: Filipino","Area: Mathematics","Area: GENERAL SCIENCE","Area: Biology","Area: Chemistry","Area: Physics","Area: Social Science","Area: Early Childhood Education","Area: Values Education","Area: SPED","Area: Music","Area: Arts","Area: Physical Education","Area: Health","Area: TLE/HE/TVL","Area: Others","Subj. Taught: All Subjects","Subj. Taught: MTB-MLE","Subj. Taught: Madrasah ALIVE","Subj. Taught: Filipino","Subj. Taught: English","Subj. Taught: Mathematics","Subj. Taught: Science","Subj. Taught: Araling Panlipunan","Subj. Taught: GMRC / EsP","Subj. Taught: MAPEH","Subj. Taught: Music and Arts","Subj. Taught: PE and Health","Subj. Taught: Makabansa","Subj. Taught: Languages / Reading and Literacy","Subj. Taught: TLE/EPP-HE","Subj. Taught: TLE/EPP-LE/Tech-Voc","Subj. Taught: ALS","Subj. Taught: IPED","Subj. Taught: Special Programs","Subj. Taught: Others","Strand: ACAD-ABM","Strand: ACAD-HUMSS","Strand: ACAD-STEM","Strand: ACAD-General Academic","Strand: ACAD-Pre-Baccalaureate Maritime","Strand: TVL-Agri-Fishery","Strand: TVL-HE","Strand: TVL-ICT","Strand: TVL-Industrial Arts","Strand: TVL-Maritime","Strand: Sports","Strand: Arts & Design","BP Yr1 1.1.2 LC","BP Yr1 1.4.2 LC","BP Yr1 1.5.2 LC","BP Yr1 2.3.2 LC","BP Yr1 2.6.2 LC","BP Yr1 3.1.2 LC","BP Yr1 4.1.2 LC","BP Yr1 4.4.2 LC","BP Yr1 4.5.2 LC","BP Yr1 5.1.2 LC","BP Yr1 5.2.2 LC","BP Yr1 5.4.2 LC","BP Yr1 7.1.2 LC","BP Yr1 7.5.2 LC","BP Yr2 1.1.2 LC","BP Yr2 1.4.2 LC","BP Yr2 1.5.2 LC","BP Yr2 1.6.2 LC","BP Yr2 2.1.2 LC","BP Yr2 2.2.2 LC","BP Yr2 3.2.2 LC","BP Yr2 3.5.2 LC","BP Yr2 4.2.2 LC","BP Yr2 5.3.2 LC","BP Yr2 5.5.2 LC","BP Yr2 6.2.2 LC","BP Yr2 7.3.2 LC","BP Yr2 7.4.2 LC","BP Yr3 1.1.2 LC","BP Yr3 1.2.2 LC","BP Yr3 1.3.2 LC","BP Yr3 1.4.2 LC","BP Yr3 1.7.2 LC","BP Yr3 2.4.2 LC","BP Yr3 2.5.2 LC","BP Yr3 3.3.2 LC","BP Yr3 3.4.2 LC","BP Yr3 4.3.2 LC","BP Yr3 6.1.2 LC","BP Yr3 6.3.2 LC","BP Yr3 6.4.2 LC","BP Yr3 7.2.2 LC","HP Yr1 1.1.3 LC","HP Yr1 1.4.3 LC","HP Yr1 1.5.3 LC","HP Yr1 2.3.3 LC","HP Yr1 2.6.3 LC","HP Yr1 3.1.3 LC","HP Yr1 4.1.3 LC","HP Yr1 4.4.3 LC","HP Yr1 4.5.3 LC","HP Yr1 5.1.3 LC","HP Yr1 5.2.3 LC","HP Yr1 5.4.3 LC","HP Yr1 7.1.3 LC","HP Yr1 7.5.3 LC","HP Yr2 1.1.3 LC","HP Yr2 1.4.3 LC","HP Yr2 1.5.3 LC","HP Yr2 1.6.3 LC","HP Yr2 2.1.3 LC","HP Yr2 2.2.3 LC","HP Yr2 3.2.3 LC","HP Yr2 3.5.3 LC","HP Yr2 4.2.3 LC","HP Yr2 5.3.3 LC","HP Yr2 5.5.3 LC","HP Yr2 6.2.3 LC","HP Yr2 7.3.3 LC","HP Yr2 7.4.3 LC","HP Yr3 1.1.3 LC","HP Yr3 1.2.3 LC","HP Yr3 1.3.3 LC","HP Yr3 1.4.3 LC","HP Yr3 1.7.3 LC","HP Yr3 2.4.3 LC","HP Yr3 2.5.3 LC","HP Yr3 3.3.3 LC","HP Yr3 3.4.3 LC","HP Yr3 4.3.3 LC","HP Yr3 6.1.3 LC","HP Yr3 6.3.3 LC","HP Yr3 6.4.3 LC","HP Yr3 7.2.3 LC","D Yr1 1.1.4 LC","D Yr1 1.4.4 LC","D Yr1 1.5.4 LC","D Yr1 2.3.4 LC","D Yr1 2.6.4 LC","D Yr1 3.1.4 LC","D Yr1 4.1.4 LC","D Yr1 4.4.4 LC","D Yr1 4.5.4 LC","D Yr1 5.1.4 LC","D Yr1 5.2.4 LC","D Yr1 5.4.4 LC","D Yr1 7.1.4 LC","D Yr1 7.5.4 LC","D Yr2 1.1.4 LC","D Yr2 1.4.4 LC","D Yr2 1.5.4 LC","D Yr2 1.6.4 LC","D Yr2 2.1.4 LC","D Yr2 2.2.4 LC","D Yr2 3.2.4 LC","D Yr2 3.5.4 LC","D Yr2 4.2.4 LC","D Yr2 5.3.4 LC","D Yr2 5.5.4 LC","D Yr2 6.2.4 LC","D Yr2 7.3.4 LC","D Yr2 7.4.4 LC","D Yr3 1.1.4 LC","D Yr3 1.2.4 LC","D Yr3 1.3.4 LC","D Yr3 1.4.4 LC","D Yr3 1.7.4 LC","D Yr3 2.4.4 LC","D Yr3 2.5.4 LC","D Yr3 3.3.4 LC","D Yr3 3.4.4 LC","D Yr3 4.3.4 LC","D Yr3 6.1.4 LC","D Yr3 6.3.4 LC","D Yr3 6.4.4 LC","D Yr3 7.2.4 LC","BP Yr1 1.1.2 PD","BP Yr1 1.4.2 PD","BP Yr1 1.5.2 PD","BP Yr1 2.3.2 PD","BP Yr1 2.6.2 PD","BP Yr1 3.1.2 PD","BP Yr1 4.1.2 PD","BP Yr1 4.4.2 PD","BP Yr1 4.5.2 PD","BP Yr1 5.1.2 PD","BP Yr1 5.2.2 PD","BP Yr1 5.4.2 PD","BP Yr1 7.1.2 PD","BP Yr1 7.5.2 PD","BP Yr2 1.1.2 PD","BP Yr2 1.4.2 PD","BP Yr2 1.5.2 PD","BP Yr2 1.6.2 PD","BP Yr2 2.1.2 PD","BP Yr2 2.2.2 PD","BP Yr2 3.2.2 PD","BP Yr2 3.5.2 PD","BP Yr2 4.2.2 PD","BP Yr2 5.3.2 PD","BP Yr2 5.5.2 PD","BP Yr2 6.2.2 PD","BP Yr2 7.3.2 PD","BP Yr2 7.4.2 PD","BP Yr3 1.1.2 PD","BP Yr3 1.2.2 PD","BP Yr3 1.3.2 PD","BP Yr3 1.4.2 PD","BP Yr3 1.7.2 PD","BP Yr3 2.4.2 PD","BP Yr3 2.5.2 PD","BP Yr3 3.3.2 PD","BP Yr3 3.4.2 PD","BP Yr3 4.3.2 PD","BP Yr3 6.1.2 PD","BP Yr3 6.3.2 PD","BP Yr3 6.4.2 PD","BP Yr3 7.2.2 PD","HP Yr1 1.1.3 PD","HP Yr1 1.4.3 PD","HP Yr1 1.5.3 PD","HP Yr1 2.3.3 PD","HP Yr1 2.6.3 PD","HP Yr1 3.1.3 PD","HP Yr1 4.1.3 PD","HP Yr1 4.4.3 PD","HP Yr1 4.5.3 PD","HP Yr1 5.1.3 PD","HP Yr1 5.2.3 PD","HP Yr1 5.4.3 PD","HP Yr1 7.1.3 PD","HP Yr1 7.5.3 PD","HP Yr2 1.1.3 PD","HP Yr2 1.4.3 PD","HP Yr2 1.5.3 PD","HP Yr2 1.6.3 PD","HP Yr2 2.1.3 PD","HP Yr2 2.2.3 PD","HP Yr2 3.2.3 PD","HP Yr2 3.5.3 PD","HP Yr2 4.2.3 PD","HP Yr2 5.3.3 PD","HP Yr2 5.5.3 PD","HP Yr2 6.2.3 PD","HP Yr2 7.3.3 PD","HP Yr2 7.4.3 PD","HP Yr3 1.1.3 PD","HP Yr3 1.2.3 PD","HP Yr3 1.3.3 PD","HP Yr3 1.4.3 PD","HP Yr3 1.7.3 PD","HP Yr3 2.4.3 PD","HP Yr3 2.5.3 PD","HP Yr3 3.3.3 PD","HP Yr3 3.4.3 PD","HP Yr3 4.3.3 PD","HP Yr3 6.1.3 PD","HP Yr3 6.3.3 PD","HP Yr3 6.4.3 PD","HP Yr3 7.2.3 PD","D Yr1 1.1.4 PD","D Yr1 1.4.4 PD","D Yr1 1.5.4 PD","D Yr1 2.3.4 PD","D Yr1 2.6.4 PD","D Yr1 3.1.4 PD","D Yr1 4.1.4 PD","D Yr1 4.4.4 PD","D Yr1 4.5.4 PD","D Yr1 5.1.4 PD","D Yr1 5.2.4 PD","D Yr1 5.4.4 PD","D Yr1 7.1.4 PD","D Yr1 7.5.4 PD","D Yr2 1.1.4 PD","D Yr2 1.4.4 PD","D Yr2 1.5.4 PD","D Yr2 1.6.4 PD","D Yr2 2.1.4 PD","D Yr2 2.2.4 PD","D Yr2 3.2.4 PD","D Yr2 3.5.4 PD","D Yr2 4.2.4 PD","D Yr2 5.3.4 PD","D Yr2 5.5.4 PD","D Yr2 6.2.4 PD","D Yr2 7.3.4 PD","D Yr2 7.4.4 PD","D Yr3 1.1.4 PD","D Yr3 1.2.4 PD","D Yr3 1.3.4 PD","D Yr3 1.4.4 PD","D Yr3 1.7.4 PD","D Yr3 2.4.4 PD","D Yr3 2.5.4 PD","D Yr3 3.3.4 PD","D Yr3 3.4.4 PD","D Yr3 4.3.4 PD","D Yr3 6.1.4 PD","D Yr3 6.3.4 PD","D Yr3 6.4.4 PD","D Yr3 7.2.4 PD","LC-LP1","LC-LP2","LC-LP3","LC-LP4","LC-LP5","LC-PPM1","LC-PPM2","LC-PPM3","LC-PPM4","LC-PPM5","LC-PD1","LC-PD2","LC-PD3","LC-PD4","LC-PD5","SM1","SM2","SM3","SM4","SM5","PE1","PE2","PE3","PE4","PE5","RF1","RF2","RF3","RF4","RF5","TW1","TW2","TW3","TW4","TW5","SO1","SO2","SO3","SO4","SO5","I1","I2","I3","I4","I5","GS1","GS2","GS3","GS4","GS5"]

{"sheet":"divisions","index":5,"n_rows":224,"n_cols":9,"rows_kept":224,"cut":false,"hidden":true,"merged":[]}
[{"$f":"IFERROR(VLOOKUP(Home!C16,divisions!$E$2:$F$18,2,0),A2)","v":"A3"},"Region","Division",null,"Region (full)","Division Table Name",null,"References (for copy-paste as needed)"]
["A3","BARMM","Basilan",null,"Bangsamoro Autonomous Region in Muslim Mindanao (BARMM)","BARMM_divlist",null,"Bangsamoro Autonomous Region in Muslim Mindanao (BARMM)","BARMM_divlist"]
[null,"BARMM","Lamitan City",null,"Cordillera Administrative Region (CAR)","CAR_divlist",null,"Cordillera Administrative Region (CAR)","CAR_divlist"]
[null,"BARMM","Lanao del Sur I",null,"National Capital Region (NCR)","NCR_divlist",null,"National Capital Region (NCR)","NCR_divlist"]
[null,"BARMM","Lanao del Sur II",null,"I - Ilocos Region","RI_divlist",null,"I - Ilocos Region","RI_divlist"]
[null,"BARMM","Maguindanao I",null,"II - Cagayan Valley","RII_divlist",null,"II - Cagayan Valley","RII_divlist"]
[null,"BARMM","Maguindanao II",null,"III - Central Luzon","RIII_divlist",null,"III - Central Luzon","RIII_divlist"]
[null,"BARMM","Marawi City",null,"IV-A - CALABARZON","RIVA_divlist",null,"IV-A - CALABARZON","RIVA_divlist"]
[null,"BARMM","Sulu",null,"IV-B - MIMAROPA","RIVB_divlist",null,"IV-B - MIMAROPA","RIVB_divlist"]
[null,"BARMM","Tawi-Tawi",null,"V - Bicol Region","RV_divlist",null,"V - Bicol Region","RV_divlist"]
[null,"CAR","Abra",null,"VI - Western Visayas","RVI_divlist",null,"VI - Western Visayas","RVI_divlist"]
[null,"CAR","Apayao",null,"VII - Central Visayas","RVII_divlist",null,"VII - Central Visayas","RVII_divlist"]
[null,"CAR","Baguio City",null,"VIII - Eastern Visayas","RVIII_divlist",null,"VIII - Eastern Visayas","RVIII_divlist"]
[null,"CAR","Benguet",null,"IX - Zamboanga Peninsula","RIX_divlist",null,"IX - Zamboanga Peninsula","RIX_divlist"]
[null,"CAR","Ifugao",null,"X - Northern Mindanao","RX_divlist",null,"X - Northern Mindanao","RX_divlist"]
[null,"CAR","Kalinga",null,"XI - Davao Region","RXI_divlist",null,"XI - Davao Region","RXI_divlist"]
[null,"CAR","Mt. Province",null,"XII - SOCCSKSARGEN","RXII_divlist",null,"XII - SOCCSKSARGEN","RXII_divlist"]
[null,"CAR","Tabuk City",null,"XIII - CARAGA Region","CARAGA_divlist",null,"XIII - CARAGA Region","CARAGA_divlist"]
[null,"NCR","Caloocan City"]
[null,"NCR","Las Piñas City"]
[null,"NCR","Makati City"]
[null,"NCR","Malabon City"]
[null,"NCR","Mandaluyong City"]
[null,"NCR","Manila"]
[null,"NCR","Marikina City"]
[null,"NCR","Muntinlupa City"]
[null,"NCR","Navotas City"]
[null,"NCR","Parañaque City"]
[null,"NCR","Pasay City"]
[null,"NCR","Pasig City"]
{"$rows_left_out":194}